Target
Tyrosine-protein kinase Lck
Ligand
BDBM50011425
Substrate
Meas. Tech.
ChEBML_210731
IC50
>2000000±n/a nM
Citation
 Cushman, MNagarathnam, DBurg, DLGeahlen, RL Synthesis and protein-tyrosine kinase inhibitory activities of flavonoid analogues. J Med Chem 34:798-806 (1991)  
Target
Name:
Tyrosine-protein kinase Lck
Synonyms:
2.7.10.2 LCK_HUMAN Leukocyte C-terminal Src kinase Lymphocyte-specific protein tyrosine kinase Protein YT16 Proto-oncogene tyrosine-protein kinase LCK T cell-specific protein-tyrosine kinase
Type:
Mol. Mass.:
57987.83
Organism:
Homo sapiens (Human)
Description:
P06239
Residue:
509
  
Inhibitor
Name:
BDBM50011425
Synonyms:
2-(3,4-Dimethoxy-phenyl)-4-oxo-4H-chromene-3-carboxylic acid methyl ester methyl 2-(3,4-dimethoxyphenyl)-4-oxo-4H-chromene-3-carboxylate
Type:
Small organic molecule
Emp. Form.:
C19H16O6
Mol. Mass.:
340.3267
SMILES:
COC(=O)c1c(oc2ccccc2c1=O)-c1ccc(OC)c(OC)c1
: