Target
Nitric oxide synthase, brain
Ligand
BDBM50266587
Substrate
Meas. Tech.
ChEMBL_1701064 (CHEMBL4052046)
Ki
36±n/a nM
Citation
 Cinelli, MALi, HChreifi, GPoulos, TLSilverman, RB Nitrile in the Hole: Discovery of a Small Auxiliary Pocket in Neuronal Nitric Oxide Synthase Leading to the Development of Potent and Selective 2-Aminoquinoline Inhibitors. J Med Chem 60:3958-3978 (2017)  
Target
Name:
Nitric oxide synthase, brain
Synonyms:
Constitutive NOS NC-NOS NOS type I nNOS NOS1_HUMAN Neuronal nitric oxide synthase Nitric oxide synthase, neuronal (nNOS) bNOS | nNOS
Type:
Homodimer
Mol. Mass.:
160985.98
Organism:
Homo sapiens (Human)
Description:
P29475
Residue:
1434
  
Inhibitor
Name:
BDBM50266587
Synonyms:
CHEMBL4096049
Type:
Small organic molecule
Emp. Form.:
C19H20Cl2N4O
Mol. Mass.:
391.294
SMILES:
Cl.Cl.CNCc1cc(OCc2ccc3ccc(N)nc3c2)cc(c1)C#N
: