Target
Lysyl oxidase homolog 2
Ligand
BDBM50266821
Substrate
Meas. Tech.
ChEMBL_1701347 (CHEMBL4052329)
IC50
130±n/a nM
Citation
 Rowbottom, MWBain, GCalderon, ILasof, TLonergan, DLai, AHuang, FDarlington, JProdanovich, PSantini, AMKing, CDGoulet, LShannon, KEMa, GLNguyen, KMacKenna, DAEvans, JFHutchinson, JH Identification of 4-(Aminomethyl)-6-(trifluoromethyl)-2-(phenoxy)pyridine Derivatives as Potent, Selective, and Orally Efficacious Inhibitors of the Copper-Dependent Amine Oxidase, Lysyl Oxidase-Like 2 (LOXL2). J Med Chem 60:4403-4423 (2017)  
Target
Name:
Lysyl oxidase homolog 2
Synonyms:
1.4.3.13 LOXL2_HUMAN Lysyl oxidase-like protein 2 Lysyl oxidase-related protein WS9-14
Type:
PROTEIN
Mol. Mass.:
86721.38
Organism:
Homo sapiens (Human)
Description:
ChEMBL_115990
Residue:
774
  
Inhibitor
Name:
BDBM50266821
Synonyms:
CHEMBL4087273 | US11072585, Example 34
Type:
Small organic molecule
Emp. Form.:
C19H21F3N4O2
Mol. Mass.:
394.3908
SMILES:
NCc1cc(O[C@H]2CCCN(C2)C(=O)Nc2ccccc2)nc(c1)C(F)(F)F
: