Target
Apoptosis regulator Bcl-2
Ligand
BDBM50162774
Substrate
Meas. Tech.
ChEMBL_1701617 (CHEMBL4052850)
Ki
<0.010000±n/a nM
Citation
 Yap, JLChen, LLanning, MEFletcher, S Expanding the Cancer Arsenal with Targeted Therapies: Disarmament of the Antiapoptotic Bcl-2 Proteins by Small Molecules. J Med Chem 60:821-838 (2017)  
Target
Name:
Apoptosis regulator Bcl-2
Synonyms:
Apoptosis regulator Bcl-2 Protein BCL-2 BCL2_HUMAN | Bcl-2 Protein
Type:
Homodimer or heterodimer
Mol. Mass.:
26269.11
Organism:
Homo sapiens (Human)
Description:
P10415
Residue:
239
  
Inhibitor
Name:
BDBM50162774
Synonyms:
ABT-199 Venetoclax
Type:
Small organic molecule
Emp. Form.:
C45H50ClN7O7S
Mol. Mass.:
868.439
SMILES:
CC1(C)CCC(CN2CCN(CC2)c2ccc(C(=O)NS(=O)(=O)c3ccc(NCC4CCOCC4)c(c3)N(=O)=O)c(Oc3cnc4[nH]ccc4c3)c2)=C(C1)c1ccc(Cl)cc1
: