Target
Adenosine receptor A1
Ligand
BDBM50006697
Substrate
Meas. Tech.
ChEBML_28998
Ki
58±n/a nM
Citation
 Erickson, RHHiner, RNFeeney, SWBlake, PRRzeszotarski, WJHicks, RPCostello, DGAbreu, ME 1,3,8-trisubstituted xanthines. Effects of substitution pattern upon adenosine receptor A1/A2 affinity. J Med Chem 34:1431-5 (1991)  
Target
Name:
Adenosine receptor A1
Synonyms:
AA1R_RAT ADENOSINE A1 high Adenosine A1 receptor (A1) Adenosine receptors A1 | Adora1
Type:
Protein
Mol. Mass.:
36704.13
Organism:
Rattus norvegicus (rat)
Description:
Residue:
326
  
Inhibitor
Name:
BDBM50006697
Synonyms:
8-Phenethyl-1,3-dipropyl-3,7-dihydro-purine-2,6-dione | CHEMBL33115
Type:
Small organic molecule
Emp. Form.:
C19H24N4O2
Mol. Mass.:
340.4195
SMILES:
CCCn1c2nc(CCc3ccccc3)[nH]c2c(=O)n(CCC)c1=O
: