Target
Polyunsaturated fatty acid lipoxygenase ALOX15
Ligand
BDBM50011932
Substrate
Meas. Tech.
ChEBML_218
IC50
33±n/a nM
Citation
 Cho, HUeda, MTamaoka, MHamaguchi, MAisaka, KKiso, YInoue, TOgino, RTatsuoka, TIshihara, T Novel caffeic acid derivatives: extremely potent inhibitors of 12-lipoxygenase. J Med Chem 34:1503-5 (1991)  
Target
Name:
Polyunsaturated fatty acid lipoxygenase ALOX15
Synonyms:
12-LOX 15-LOX Alox15 Arachidonate 12-lipoxygenase, leukocyte-type LOX15_RAT
Type:
PROTEIN
Mol. Mass.:
75377.59
Organism:
Rattus norvegicus
Description:
ChEMBL_1510006
Residue:
663
  
Inhibitor
Name:
BDBM50011932
Synonyms:
2-Cyano-3-(3,4-dihydroxy-phenyl)-acrylic acid ethyl ester | CHEMBL38168
Type:
Small organic molecule
Emp. Form.:
C12H11NO4
Mol. Mass.:
233.22
SMILES:
CCOC(=O)C(=C\c1ccc(O)c(O)c1)\C#N
: