Target
Type-2 angiotensin II receptor
Ligand
BDBM50011975
Substrate
Meas. Tech.
ChEMBL_36494 (CHEMBL652311)
IC50
1.5±n/a nM
Citation
 Weinstock, JKeenan, RMSamanen, JHempel, JFinkelstein, JAFranz, RGGaitanopoulos, DEGirard, GRGleason, JGHill, DT 1-(carboxybenzyl)imidazole-5-acrylic acids: potent and selective angiotensin II receptor antagonists. J Med Chem 34:1514-7 (1991)  
Target
Name:
Type-2 angiotensin II receptor
Synonyms:
AGTR2_RAT Agtr2 Angiotensin II receptor Type-2 angiotensin II receptor
Type:
Enzyme Catalytic Domain
Mol. Mass.:
41346.62
Organism:
RAT
Description:
Angiotensin II AT2 0 0::P35351
Residue:
363
  
Inhibitor
Name:
BDBM50011975
Synonyms:
4-[2-Butyl-5-((E)-2-carboxy-3-thiophen-2-yl-propenyl)-imidazol-1-ylmethyl]-3-chloro-benzoic acid CHEMBL37679
Type:
Small organic molecule
Emp. Form.:
C23H23ClN2O4S
Mol. Mass.:
458.958
SMILES:
CCCCc1ncc(\C=C(/Cc2cccs2)C(O)=O)n1Cc1ccc(cc1Cl)C(O)=O
: