Target
Muscarinic acetylcholine receptor M3
Ligand
BDBM82376
Substrate
Meas. Tech.
ChEBML_138964
Ki
6.9±n/a nM
Citation
 Karton, YBradbury, BJBaumgold, JPaek, RJacobson, KA Functionalized congener approach to muscarinic antagonists: analogues of pirenzepine. J Med Chem 34:2133-45 (1991)  
Target
Name:
Muscarinic acetylcholine receptor M3
Synonyms:
ACM3_RAT Chrm-3 | Chrm3
Type:
Enzyme Catalytic Domain
Mol. Mass.:
66086.66
Organism:
RAT
Description:
Cholinergic, muscarinic M3 CHRM3 RAT::P08483
Residue:
589
  
Inhibitor
Name:
BDBM82376
Synonyms:
CAS_80880-90-6 TELENZEPINE
Type:
Small organic molecule
Emp. Form.:
C19H22N4O2S
Mol. Mass.:
370.469
SMILES:
CN1CCN(CC(=O)N2c3c(C)scc3C(=O)Nc3ccccc23)CC1
: