Target
Coagulation factor XI
Ligand
BDBM50269199
Substrate
Meas. Tech.
ChEMBL_1705740 (CHEMBL4056973)
Ki
0.070000±n/a nM
Citation
 Corte, JRYang, WFang, TWang, YOsuna, HLai, AEwing, WRRossi, KAMyers, JESheriff, SLou, ZZheng, JJHarper, TWBozarth, JMWu, YLuettgen, JMSeiffert, DAQuan, MLWexler, RRLam, PYS Macrocyclic inhibitors of Factor XIa: Discovery of alkyl-substituted macrocyclic amide linkers with improved potency. Bioorg Med Chem Lett 27:3833-3839 (2017)  
Target
Name:
Coagulation factor XI
Synonyms:
Coagulation factor XIa Coagulation factor XIa light chain FA11_HUMAN Factor XIa PTA | Plasma thromboplastin antecedent
Type:
Enzyme
Mol. Mass.:
70130.58
Organism:
Homo sapiens (Human)
Description:
P03951
Residue:
625
  
Inhibitor
Name:
BDBM50269199
Synonyms:
CHEMBL4083769
Type:
Small organic molecule
Emp. Form.:
C28H27Cl2N9O4
Mol. Mass.:
624.478
SMILES:
COC(=O)Nc1ccc2-c3nc([nH]c3Cl)[C@H](CCC[C@@H](C)C(=O)Nc2c1)NC(=O)\C=C\c1cc(Cl)ccc1-n1cnnn1
: