Target
Polyunsaturated fatty acid 5-lipoxygenase
Ligand
BDBM50012793
Substrate
Meas. Tech.
ChEBML_3819
IC50
130±n/a nM
Citation
 Lazer, ESWong, HCWegner, CDGraham, AGFarina, PR Effect of structure on potency and selectivity in 2,6-disubstituted 4-(2-arylethenyl)phenol lipoxygenase inhibitors. J Med Chem 33:1892-8 (1990)  
Target
Name:
Polyunsaturated fatty acid 5-lipoxygenase
Synonyms:
5-LO 5-Lipoxygenase (5-LO) 5-Lipoygenase ALOX5 LOG5 | LOX5_HUMAN
Type:
Enzyme
Mol. Mass.:
77972.74
Organism:
Homo sapiens (Human)
Description:
Recombinant protein was purified from E. coli lysate. After ammonium sulfate precipitation and subsequent steps, the supernatant (S100) was used for 5-LO activity assay.
Residue:
674
  
Inhibitor
Name:
BDBM50012793
Synonyms:
2,6-Dimethyl-4-(2-m-tolyl-vinyl)-phenol | CHEMBL56461
Type:
Small organic molecule
Emp. Form.:
C17H18O
Mol. Mass.:
238.3242
SMILES:
Cc1cccc(\C=C\c2cc(C)c(O)c(C)c2)c1
: