Target
Polyunsaturated fatty acid 5-lipoxygenase
Ligand
BDBM50012791
Substrate
Meas. Tech.
ChEBML_3819
IC50
>1000±n/a nM
Citation
 Lazer, ESWong, HCWegner, CDGraham, AGFarina, PR Effect of structure on potency and selectivity in 2,6-disubstituted 4-(2-arylethenyl)phenol lipoxygenase inhibitors. J Med Chem 33:1892-8 (1990)  
Target
Name:
Polyunsaturated fatty acid 5-lipoxygenase
Synonyms:
5-LO 5-Lipoxygenase (5-LO) 5-Lipoygenase ALOX5 LOG5 | LOX5_HUMAN
Type:
Enzyme
Mol. Mass.:
77972.74
Organism:
Homo sapiens (Human)
Description:
Recombinant protein was purified from E. coli lysate. After ammonium sulfate precipitation and subsequent steps, the supernatant (S100) was used for 5-LO activity assay.
Residue:
674
  
Inhibitor
Name:
BDBM50012791
Synonyms:
2,6-Di-tert-butyl-4-[2-(4-methoxy-phenyl)-vinyl]-phenol | CHEMBL8959
Type:
Small organic molecule
Emp. Form.:
C23H30O2
Mol. Mass.:
338.4831
SMILES:
COc1ccc(\C=C\c2cc(c(O)c(c2)C(C)(C)C)C(C)(C)C)cc1
: