Target
Cytochrome P450 2D6
Ligand
BDBM50443541
Substrate
Meas. Tech.
ChEBML_1707937
IC50
320±n/a nM
Citation
 Miller, EJJecs, ETruax, VMKatzman, BMTahirovic, YAWilson, RJKuo, KMKim, MBNguyen, HHSaindane, MTZhao, HWang, TSum, CSCvijic, MESchroeder, GMWilson, LJLiotta, DC Discovery of Tetrahydroisoquinoline-Containing CXCR4 Antagonists with Improved in Vitro ADMET Properties. J Med Chem 61:946-979 (2018)  
Target
Name:
Cytochrome P450 2D6
Synonyms:
CP2D6_HUMAN CYP2DL1 Cytochrome P450 2D6 (CYP2D6) P450-DB1
Type:
Protein
Mol. Mass.:
55774.82
Organism:
Homo sapiens (Human)
Description:
P10635
Residue:
497
  
Inhibitor
Name:
BDBM50443541
Synonyms:
CHEMBL3091687
Type:
Small organic molecule
Emp. Form.:
C23H32N4
Mol. Mass.:
364.527
SMILES:
NCCCCN(C[C@H]1Cc2ccccc2CN1)[C@H]1CCCc2cccnc12
: