Target
Receptor-type tyrosine-protein kinase FLT3
Ligand
BDBM50270303
Substrate
Meas. Tech.
ChEMBL_1707954 (CHEMBL4059187)
IC50
0.470000±n/a nM
Citation
 Wang, YZhi, YJin, QLu, SLin, GYuan, HYang, TWang, ZYao, CLing, JGuo, HLi, TJin, JLi, BZhang, LChen, YLu, T Discovery of 4-((7H-Pyrrolo[2,3-d]pyrimidin-4-yl)amino)-N-(4-((4-methylpiperazin-1-yl)methyl)phenyl)-1H-pyrazole-3-carboxamide (FN-1501), an FLT3- and CDK-Kinase Inhibitor with Potentially High Efficiency against Acute Myelocytic Leukemia. J Med Chem 61:1499-1518 (2018)  
Target
Name:
Receptor-type tyrosine-protein kinase FLT3
Synonyms:
CD135 FL cytokine receptor FLK2 FLT3 Fetal liver kinase-2 Fms-like tyrosine kinase 3 (Flt-3) STK-1 Stem cell tyrosine kinase 1
Type:
Enzyme
Mol. Mass.:
112888.62
Organism:
Homo sapiens (Human)
Description:
P36888
Residue:
993
  
Inhibitor
Name:
BDBM50270303
Synonyms:
CHEMBL4061686
Type:
Small organic molecule
Emp. Form.:
C22H24N8OS
Mol. Mass.:
448.544
SMILES:
CN1CCN(Cc2ccc(NC(=O)c3n[nH]cc3Nc3ncnc4ccsc34)cc2)CC1
: