Target
Potassium-transporting ATPase alpha chain 1
Ligand
BDBM50013238
Substrate
Meas. Tech.
ChEBML_76081
IC50
22000±n/a nM
Citation
 Brown, THIfe, RJKeeling, DJLaing, SMLeach, CAParsons, MEPrice, CAReavill, DRWiggall, KJ Reversible inhibitors of the gastric (H+/K+)-ATPase. 1. 1-Aryl-4-methylpyrrolo[3,2-c]quinolines as conformationally restrained analogues of 4-(arylamino)quinolines. J Med Chem 33:527-33 (1990)  
Target
Name:
Potassium-transporting ATPase alpha chain 1
Synonyms:
ATP4A Gastric H(+)/K(+) ATPase subunit alpha Na/K-ATPase Potassium-transporting ATPase alpha chain 1 | Proton pump
Type:
Enzyme
Mol. Mass.:
114279.23
Organism:
Sus scrofa (Pig)
Description:
P19156
Residue:
1034
  
Inhibitor
Name:
BDBM50013238
Synonyms:
1-o-Tolyl-1,3-dihydro-imidazo[4,5-c]quinoline-2-thione | CHEMBL356246
Type:
Small organic molecule
Emp. Form.:
C17H13N3S
Mol. Mass.:
291.37
SMILES:
Cc1ccccc1-n1c2c(cnc3ccccc23)[nH]c1=S
: