Target
Cysteinyl leukotriene receptor 1
Ligand
BDBM50013524
Substrate
Meas. Tech.
ChEBML_52212
Ki
31±n/a nM
Citation
 Youssefyeh, RDMagnien, ELee, TDChan, WKLin, CJGalemmo, RAJohnson, WHTan, JCampbell, HFHuang, FC Development of a novel series of (2-quinolinylmethoxy)phenyl-containing compounds as high-affinity leukotriene receptor antagonists. 1. Initial structure-activity relationships. J Med Chem 33:1186-94 (1990)  
Target
Name:
Cysteinyl leukotriene receptor 1
Synonyms:
CLTR1_CAVPO | CYSLTR1
Type:
Enzyme Catalytic Domain
Mol. Mass.:
39007.58
Organism:
GUINEA PIG
Description:
Leukotriene D4 0 GUINEA PIG::Q2NNR5
Residue:
340
  
Inhibitor
Name:
BDBM50013524
Synonyms:
CHEMBL278920 | N-{4-[4-(Quinolin-2-ylmethoxy)-phenoxy]-butyryl}-benzenesulfonamide
Type:
Small organic molecule
Emp. Form.:
C26H24N2O5S
Mol. Mass.:
476.544
SMILES:
O=C(CCCOc1ccc(OCc2ccc3ccccc3n2)cc1)NS(=O)(=O)c1ccccc1
: