Target
Cysteinyl leukotriene receptor 1
Ligand
BDBM50013567
Substrate
Meas. Tech.
ChEBML_52211
Ki
13±n/a nM
Citation
 Huang, FCGalemmo, RAJohnson, WHPoli, GBMorrissette, MMMencel, JJWarus, JDCampbell, HFNuss, GWCarnathan, GW Development of a novel series of (2-quinolinylmethoxy)phenyl-containing compounds as high-affinity leukotriene D4 receptor antagonists. 2. Effects of an additional phenyl ring on receptor affinity. J Med Chem 33:1194-200 (1990)  
Target
Name:
Cysteinyl leukotriene receptor 1
Synonyms:
CLTR1_CAVPO | CYSLTR1
Type:
Enzyme Catalytic Domain
Mol. Mass.:
39007.58
Organism:
GUINEA PIG
Description:
Leukotriene D4 0 GUINEA PIG::Q2NNR5
Residue:
340
  
Inhibitor
Name:
BDBM50013567
Synonyms:
2-{3-[3-(1H-Tetrazol-5-ylmethoxy)-benzyloxy]-phenoxymethyl}-quinoline | CHEMBL417271
Type:
Small organic molecule
Emp. Form.:
C25H21N5O3
Mol. Mass.:
439.4659
SMILES:
C(Oc1cccc(COc2cccc(OCc3ccc4ccccc4n3)c2)c1)c1nnn[nH]1
: