Target
Cysteinyl leukotriene receptor 1
Ligand
BDBM50013561
Substrate
Meas. Tech.
ChEBML_52211
Ki
7.3±n/a nM
Citation
 Huang, FCGalemmo, RAJohnson, WHPoli, GBMorrissette, MMMencel, JJWarus, JDCampbell, HFNuss, GWCarnathan, GW Development of a novel series of (2-quinolinylmethoxy)phenyl-containing compounds as high-affinity leukotriene D4 receptor antagonists. 2. Effects of an additional phenyl ring on receptor affinity. J Med Chem 33:1194-200 (1990)  
Target
Name:
Cysteinyl leukotriene receptor 1
Synonyms:
CLTR1_CAVPO | CYSLTR1
Type:
Enzyme Catalytic Domain
Mol. Mass.:
39007.58
Organism:
GUINEA PIG
Description:
Leukotriene D4 0 GUINEA PIG::Q2NNR5
Residue:
340
  
Inhibitor
Name:
BDBM50013561
Synonyms:
2-{3-[4-(1H-Tetrazol-5-ylmethyl)-benzyloxy]-phenoxymethyl}-quinoline | CHEMBL18405
Type:
Small organic molecule
Emp. Form.:
C25H21N5O2
Mol. Mass.:
423.4665
SMILES:
C(Oc1cccc(OCc2ccc3ccccc3n2)c1)c1ccc(Cc2nnn[nH]2)cc1
: