Target
P2Y purinoceptor 2
Ligand
BDBM50271597
Substrate
Meas. Tech.
ChEMBL_1711179 (CHEMBL4121228)
Ki
1549±n/a nM
Citation
 Conroy, SKindon, NDGlenn, JStoddart, LALewis, RJHill, SJKellam, BStocks, MJ Synthesis and Evaluation of the First Fluorescent Antagonists of the Human P2Y J Med Chem 61:3089-3113 (2018)  
Target
Name:
P2Y purinoceptor 2
Synonyms:
ATP receptor P2RY2 P2U purinoceptor 1 P2Y purinoceptor 2 Purinergic receptor | Purinergic receptor P2Y2
Type:
PROTEIN
Mol. Mass.:
42299.21
Organism:
Homo sapiens (Human)
Description:
ChEMBL_1455361
Residue:
377
  
Inhibitor
Name:
BDBM50271597
Synonyms:
CHEMBL4127983
Type:
Small organic molecule
Emp. Form.:
C18H14ClN3OS2
Mol. Mass.:
387.906
SMILES:
Cc1nc2C(c3ccc(Cl)cc3C=Cc2s1)c1cn(C)c(=O)[nH]c1=S
: