Target
Vasopressin V2 receptor
Ligand
BDBM50013634
Substrate
Meas. Tech.
ChEBML_215028
Ki
1800±n/a nM
Citation
 Freidinger, RMWilliams, PDTung, RDBock, MGPettibone, DJClineschmidt, BVDiPardo, RMErb, JMGarsky, VMGould, NP Cyclic hexapeptide oxytocin antagonists. Potency-, selectivity-, and solubility-enhancing modifications. J Med Chem 33:1843-5 (1990)  
Target
Name:
Vasopressin V2 receptor
Synonyms:
AVPR V2 Avpr2 V2R_RAT Vasopressin receptor
Type:
G-protein coupled receptor
Mol. Mass.:
40761.85
Organism:
Rattus norvegicus (Rat)
Description:
Residue:
371
  
Inhibitor
Name:
BDBM50013634
Synonyms:
24-(1H-5-imidazolylmethyl)-16-(1H-3-indolylmethyl)-13-[1-methyl-(1S)-propyl]perhydrodipyrido[1,2-a:1,2-d]pyrrolo[1,2-j][1,4,7,10,13,16]hexaazacyclooctadecine-6,12,15,18,23,26-hexaone | CHEMBL52176
Type:
Small organic molecule
Emp. Form.:
C40H53N9O6
Mol. Mass.:
755.9055
SMILES:
CC[C@H](C)[C@@H]1NC(=O)[C@H](Cc2c[nH]c3ccccc23)NC(=O)[C@H]2CCCN2C(=O)[C@H](Cc2cnc[nH]2)NC(=O)[C@H]2CCCCN2C(=O)[C@@H]2CCCCN2C1=O
: