Target
Cholinesterase
Ligand
BDBM50014110
Substrate
Meas. Tech.
ChEMBL_41592 (CHEMBL654886)
IC50
16±n/a nM
Citation
 Brossi, A Alfred Burger award address. Bioactive alkaloids. 4. Results of recent investigations with colchicine and physostigmine. J Med Chem 33:2311-9 (1990)  
Target
Name:
Cholinesterase
Synonyms:
Acylcholine acylhydrolase Butyrylcholine esterase (BChE) Butyrylcholinesterase (BuChE) CHLE_HUMAN Cholinesterases Pseudocholinesterase
Type:
Homotetramer
Mol. Mass.:
68422.27
Organism:
Homo sapiens (Human)
Description:
P06276
Residue:
602
  
Inhibitor
Name:
BDBM50014110
Synonyms:
CHEMBL307721 | Methyl-carbamic acid 1-allyl-3a,8-dimethyl-1,2,3,3a,8,8a-hexahydro-pyrrolo[2,3-b]indol-5-yl ester
Type:
Small organic molecule
Emp. Form.:
C17H23N3O2
Mol. Mass.:
301.3834
SMILES:
CNC(=O)Oc1ccc2N(C)[C@H]3N(CC=C)CC[C@@]3(C)c2c1
: