Target
Polyunsaturated fatty acid 5-lipoxygenase
Ligand
BDBM7460
Substrate
Meas. Tech.
ChEMBL_3956 (CHEMBL618054)
IC50
500±n/a nM
Citation
 Malleron, JLRoussel, GGueremy, GPonsinet, GRobin, JLTerlain, BTissieres, JM Penta- and hexadienoic acid derivatives: a novel series of 5-lipoxygenase inhibitors. J Med Chem 33:2744-9 (1990)  
Target
Name:
Polyunsaturated fatty acid 5-lipoxygenase
Synonyms:
Alox5 LOX5_RAT
Type:
PROTEIN
Mol. Mass.:
78082.31
Organism:
Rattus norvegicus
Description:
ChEMBL_1432947
Residue:
673
  
Inhibitor
Name:
BDBM7460
Synonyms:
2-(3,4-dihydroxyphenyl)-3,5,7-trihydroxy-4H-chromen-4-one 2-(3,4-dihydroxyphenyl)-3,5,7-trihydroxy-chromone;hydrate Quercetin Quercetin (21) US11021454, Compound Quercetin med.21724, Compound 4
Type:
Small organic molecule
Emp. Form.:
C15H10O7
Mol. Mass.:
302.2357
SMILES:
Oc1cc(O)c2c(c1)oc(-c1ccc(O)c(O)c1)c(O)c2=O
: