Target
Dihydrofolate reductase
Ligand
BDBM50014480
Substrate
Meas. Tech.
ChEBML_55293
Ki
2250±n/a nM
Citation
 Hughes, LRJackman, ALOldfield, JSmith, RCBurrows, KDMarsham, PRBishop, JAJones, TRO'Connor, BMCalvert, AH Quinazoline antifolate thymidylate synthase inhibitors: alkyl, substituted alkyl, and aryl substituents in the C2 position. J Med Chem 33:3060-7 (1990)  
Target
Name:
Dihydrofolate reductase
Synonyms:
DYR_RAT Dihydrofolate reductase (DHFR) Tetrahydrofolate dehydrogenase
Type:
Enzyme
Mol. Mass.:
21638.84
Organism:
Rattus norvegicus (rat)
Description:
Residue:
187
  
Inhibitor
Name:
BDBM50014480
Synonyms:
(S)-2-(4-(((4-oxo-3,4-dihydroquinazolin-6-yl)methyl)(prop-2-ynyl)amino)benzamido)pentanedioic acid CHEMBL103059
Type:
Small organic molecule
Emp. Form.:
C24H22N4O6
Mol. Mass.:
462.4547
SMILES:
OC(=O)CC[C@H](NC(=O)c1ccc(cc1)N(CC#C)Cc1ccc2nc[nH]c(=O)c2c1)C(O)=O
: