Target
Thymidylate synthase
Ligand
BDBM50006684
Substrate
Meas. Tech.
ChEBML_209796
IC50
1430±n/a nM
Citation
 Marsham, PRJackman, ALOldfield, JHughes, LRThornton, TJBisset, GMO'Connor, BMBishop, JACalvert, AH Quinazoline antifolate thymidylate synthase inhibitors: benzoyl ring modifications in the C2-methyl series. J Med Chem 33:3072-8 (1990)  
Target
Name:
Thymidylate synthase
Synonyms:
TS TYSY_MOUSE | Tyms
Type:
PROTEIN
Mol. Mass.:
34957.15
Organism:
Mus musculus
Description:
ChEMBL_1340097
Residue:
307
  
Inhibitor
Name:
BDBM50006684
Synonyms:
(S)-2-(3-fluoro-4-(((2-methyl-4-oxo-3,4-dihydroquinazolin-6-yl)methyl)(prop-2-ynyl)amino)benzamido)pentanedioic acid 2-{3-Fluoro-4-[(2-methyl-4-oxo-3,4-dihydro-quinazolin-6-ylmethyl)-prop-2-ynyl-amino]-benzoylamino}-pentanedioic acid ;hydrate(H2O) | CHEMBL307399
Type:
Small organic molecule
Emp. Form.:
C25H23FN4O6
Mol. Mass.:
494.4717
SMILES:
Cc1nc2ccc(CN(CC#C)c3ccc(cc3F)C(=O)N[C@@H](CCC(O)=O)C(O)=O)cc2c(=O)[nH]1
: