Target
Thymidylate synthase
Ligand
BDBM50014481
Substrate
Meas. Tech.
ChEBML_209796
IC50
480±n/a nM
Citation
 Marsham, PRJackman, ALOldfield, JHughes, LRThornton, TJBisset, GMO'Connor, BMBishop, JACalvert, AH Quinazoline antifolate thymidylate synthase inhibitors: benzoyl ring modifications in the C2-methyl series. J Med Chem 33:3072-8 (1990)  
Target
Name:
Thymidylate synthase
Synonyms:
TS TYSY_MOUSE | Tyms
Type:
PROTEIN
Mol. Mass.:
34957.15
Organism:
Mus musculus
Description:
ChEMBL_1340097
Residue:
307
  
Inhibitor
Name:
BDBM50014481
Synonyms:
(S)-2-(4-(allyl((2-methyl-4-oxo-3,4-dihydroquinazolin-6-yl)methyl)amino)benzamido)pentanedioic acid CHEMBL323539
Type:
Small organic molecule
Emp. Form.:
C25H26N4O6
Mol. Mass.:
478.4971
SMILES:
Cc1nc2ccc(CN(CC=C)c3ccc(cc3)C(=O)N[C@@H](CCC(O)=O)C(O)=O)cc2c(=O)[nH]1
: