Target
Thymidylate synthase
Ligand
BDBM50006690
Substrate
Meas. Tech.
ChEBML_209796
IC50
1140±n/a nM
Citation
 Marsham, PRJackman, ALOldfield, JHughes, LRThornton, TJBisset, GMO'Connor, BMBishop, JACalvert, AH Quinazoline antifolate thymidylate synthase inhibitors: benzoyl ring modifications in the C2-methyl series. J Med Chem 33:3072-8 (1990)  
Target
Name:
Thymidylate synthase
Synonyms:
TS TYSY_MOUSE | Tyms
Type:
PROTEIN
Mol. Mass.:
34957.15
Organism:
Mus musculus
Description:
ChEMBL_1340097
Residue:
307
  
Inhibitor
Name:
BDBM50006690
Synonyms:
(S)-2-(3-fluoro-4-(methyl((2-methyl-4-oxo-3,4-dihydroquinazolin-6-yl)methyl)amino)benzamido)pentanedioic acid 2-{3-Fluoro-4-[methyl-(2-methyl-4-oxo-3,4-dihydro-quinazolin-6-ylmethyl)-amino]-benzoylamino}-pentanedioic acid ;hydrate(H2O) | CHEMBL73971
Type:
Small organic molecule
Emp. Form.:
C23H23FN4O6
Mol. Mass.:
470.4503
SMILES:
CN(Cc1ccc2nc(C)[nH]c(=O)c2c1)c1ccc(cc1F)C(=O)N[C@@H](CCC(O)=O)C(O)=O
: