Target
Phosphatidylinositol 4,5-bisphosphate 3-kinase catalytic subunit gamma isoform
Ligand
BDBM50274543
Substrate
Meas. Tech.
ChEMBL_1714083 (CHEMBL4124132)
Ki
9.0±n/a nM
Citation
 Come, JHCollier, PNHenderson, JAPierce, ACDavies, RJLe Tiran, AO'Dowd, HBandarage, UKCao, JDeininger, DGrey, RKrueger, EBLowe, DBLiang, JLiao, YMessersmith, DNanthakumar, SSizensky, EWang, JXu, JChin, EYDamagnez, VDoran, JDDworakowski, WGriffith, JPJacobs, MDKhare-Pandit, SMahajan, SMoody, CSAronov, AM Design and Synthesis of a Novel Series of Orally Bioavailable, CNS-Penetrant, Isoform Selective Phosphoinositide 3-Kinase? (PI3K?) Inhibitors with Potential for the Treatment of Multiple Sclerosis (MS). J Med Chem 61:5245-5256 (2018)  
Target
Name:
Phosphatidylinositol 4,5-bisphosphate 3-kinase catalytic subunit gamma isoform
Synonyms:
PI3-kinase p110 subunit gamma PI3Kgamma PK3CG_HUMAN Phosphatidylinositol 4,5-bisphosphate 3-kinase (PI3K) Phosphatidylinositol 4,5-bisphosphate 3-kinase catalytic subunit gamma (PI3Kgamma) Phosphatidylinositol 4,5-bisphosphate 3-kinase catalytic subunit gamma isoform (PI3K) Phosphatidylinositol-4,5-bisphosphate 3-kinase catalytic subunit gamma isoform Phosphoinositide 3-kinases gamma (PI3K gamma) p120-PI3K
Type:
Enzyme Subunit
Mol. Mass.:
126470.30
Organism:
Homo sapiens (Human)
Description:
P48736
Residue:
1102
  
Inhibitor
Name:
BDBM50274543
Synonyms:
CHEMBL4129251
Type:
Small organic molecule
Emp. Form.:
C19H17F2N5O3
Mol. Mass.:
401.3668
SMILES:
COc1cc(cnc1OC)-c1ccc2C(=O)N(Cc2n1)c1cnn(CC(F)F)c1
: