Target
Cathepsin G
Ligand
BDBM50014741
Substrate
Meas. Tech.
ChEMBL_45522 (CHEMBL661860)
Ki
200±n/a nM
Citation
 Peet, NPBurkhart, JPAngelastro, MRGiroux, ELMehdi, SBey, PKolb, MNeises, BSchirlin, D Synthesis of peptidyl fluoromethyl ketones and peptidyl alpha-keto esters as inhibitors of porcine pancreatic elastase, human neutrophil elastase, and rat and human neutrophil cathepsin G. J Med Chem 33:394-407 (1990)  
Target
Name:
Cathepsin G
Synonyms:
CATG_HUMAN CTSG
Type:
PROTEIN
Mol. Mass.:
28860.08
Organism:
Homo sapiens (Human)
Description:
ChEMBL_1469016
Residue:
255
  
Inhibitor
Name:
BDBM50014741
Synonyms:
CHEMBL130190 | N-{1-[2-(1-Benzyl-3,3,3-trifluoro-2-oxo-propylcarbamoyl)-pyrrolidine-1-carbonyl]-2-methyl-propyl}-succinamic acid methyl ester
Type:
Small organic molecule
Emp. Form.:
C25H32F3N3O6
Mol. Mass.:
527.5333
SMILES:
COC(=O)CCC(=O)N[C@@H](C(C)C)C(=O)N1CCC[C@H]1C(=O)N[C@@H](Cc1ccccc1)C(=O)C(F)(F)F
: