Target
Chymotrypsin-like elastase family member 1/2A
Ligand
BDBM50014738
Substrate
Meas. Tech.
ChEMBL_64822 (CHEMBL678403)
Ki
15±n/a nM
Citation
 Peet, NPBurkhart, JPAngelastro, MRGiroux, ELMehdi, SBey, PKolb, MNeises, BSchirlin, D Synthesis of peptidyl fluoromethyl ketones and peptidyl alpha-keto esters as inhibitors of porcine pancreatic elastase, human neutrophil elastase, and rat and human neutrophil cathepsin G. J Med Chem 33:394-407 (1990)  
Target
Name:
Chymotrypsin-like elastase family member 1/2A
Synonyms:
Pancreatic elastase
Type:
Mol. Mass.:
Description:
ASSAY_ID of ChEMBL is 152345
Components:
This complex has 2 components.
Component 1
Name:
Chymotrypsin-like elastase family member 1
Synonyms:
CELA1 ELA1 Elastase 1 Pancreatic elastase
Type:
Enzyme
Mol. Mass.:
28827.71
Organism:
Sus scrofa (Pig)
Description:
P00772
Residue:
266
  
Component 2
Name:
Chymotrypsin-like elastase family member 2A
Synonyms:
CEL2A_PIG ELA2 Elastase 2A Elastase-2A | Pancreatic elastase
Type:
PROTEIN
Mol. Mass.:
28705.23
Organism:
Sus scrofa
Description:
ChEMBL_156951
Residue:
269
  
Inhibitor
Name:
BDBM50014738
Synonyms:
CHEMBL130253 | N-(Adamantyl-sulfonyl)-N-(methoxy succinate) lys-pro-val-trifluromethane
Type:
Small organic molecule
Emp. Form.:
C32H49F3N4O8S
Mol. Mass.:
706.814
SMILES:
COC(=O)CCC(=O)NCCCC[C@H](NS(=O)(=O)C12CC3CC(CC(C3)C1)C2)C(=O)N1CCC[C@H]1C(=O)N[C@@H](C(C)C)C(=O)C(F)(F)F
: