Target
5-hydroxytryptamine receptor 1B
Ligand
BDBM50014946
Substrate
Meas. Tech.
ChEBML_1798
Ki
800±n/a nM
Citation
 Ismaiel, AMTiteler, MMiller, KJSmith, TSGlennon, RA 5-HT1 and 5-HT2 binding profiles of the serotonergic agents alpha-methylserotonin and 2-methylserotonin. J Med Chem 33:755-8 (1990)  
Target
Name:
5-hydroxytryptamine receptor 1B
Synonyms:
5-HT-1B 5-hydroxytryptamine receptor 1B (5HT1B) 5ht1b Serotonin 1 (5-HT1) receptor Serotonin receptor 1B
Type:
Protein
Mol. Mass.:
43173.33
Organism:
Rattus norvegicus (Rat)
Description:
P28564
Residue:
386
  
Inhibitor
Name:
BDBM50014946
Synonyms:
2-(5-Methoxy-2-methyl-1H-indol-3-yl)-ethylamine CHEMBL268800
Type:
Small organic molecule
Emp. Form.:
C12H16N2O
Mol. Mass.:
204.2682
SMILES:
COc1ccc2[nH]c(C)c(CCN)c2c1
: