Target
Neurogenic locus notch homolog protein 1
Ligand
BDBM50277174
Substrate
Meas. Tech.
ChEBML_1717673
IC50
300±n/a nM
Citation
 Yoneyama, TArai, MAAkamine, RKoryudzu, KTsuchiya, ASadhu, SKAhmed, FItoh, MOkamoto, RIshibashi, M Notch Inhibitors from Calotropis gigantea That Induce Neuronal Differentiation of Neural Stem Cells. J Nat Prod 80:2453-2461 (2017)  
Target
Name:
Neurogenic locus notch homolog protein 1
Synonyms:
NEXT NOTC1_HUMAN Neurogenic locus notch homolog protein 1 Notch 1 Notch 1 intracellular domain TAN1 hN1
Type:
Enzyme
Mol. Mass.:
272417.95
Organism:
Homo sapiens (Human)
Description:
P46531
Residue:
2555
  
Inhibitor
Name:
BDBM50277174
Synonyms:
CHEMBL4164399
Type:
Small organic molecule
Emp. Form.:
C31H41NO9S
Mol. Mass.:
603.724
SMILES:
[H][C@@]12CC[C@]3([H])[C@]([H])(CC[C@]4(C)[C@H](CC[C@]34O)C3=CC(=O)OC3)[C@]1(C[C@@]1([H])O[C@]3(O)[C@@]([H])(O[C@H](C)C[C@@]33NC(=O)CS3)O[C@]1([H])C2)C=O
: