Target
Polyunsaturated fatty acid 5-lipoxygenase
Ligand
BDBM50406364
Substrate
Meas. Tech.
ChEMBL_4284 (CHEMBL618395)
IC50
1500±n/a nM
Citation
 Summers, JBKim, KHMazdiyasni, HHolms, JHRatajczyk, JDStewart, AODyer, RDCarter, GW Hydroxamic acid inhibitors of 5-lipoxygenase: quantitative structure-activity relationships. J Med Chem 33:992-8 (1990)  
Target
Name:
Polyunsaturated fatty acid 5-lipoxygenase
Synonyms:
Alox5 LOX5_RAT
Type:
PROTEIN
Mol. Mass.:
78082.31
Organism:
Rattus norvegicus
Description:
ChEMBL_1432947
Residue:
673
  
Inhibitor
Name:
BDBM50406364
Synonyms:
CHEMBL173711
Type:
Small organic molecule
Emp. Form.:
C20H25NO2
Mol. Mass.:
311.418
SMILES:
CC(C)Cc1ccc(cc1)C(Cc1ccccc1)C(=O)N(C)O
: