Target
Receptor-type tyrosine-protein kinase FLT3
Ligand
BDBM50277604
Substrate
Meas. Tech.
ChEMBL_1718273 (CHEMBL4133273)
Ki
64±n/a nM
Citation
 Diab, SAbdelaziz, AMLi, PTeo, TBasnet, SKCNoll, BRahaman, MHLu, JHou, JYu, MLe, BTAlbrecht, HMilne, RWWang, S Dual Inhibition of Mnk2 and FLT3 for potential treatment of acute myeloid leukaemia. Eur J Med Chem 139:762-772 (2017)  
Target
Name:
Receptor-type tyrosine-protein kinase FLT3
Synonyms:
CD135 FL cytokine receptor FLK2 FLT3 Fetal liver kinase-2 Fms-like tyrosine kinase 3 (Flt-3) STK-1 Stem cell tyrosine kinase 1
Type:
Enzyme
Mol. Mass.:
112888.62
Organism:
Homo sapiens (Human)
Description:
P36888
Residue:
993
  
Inhibitor
Name:
BDBM50277604
Synonyms:
CHEMBL4159742
Type:
Small organic molecule
Emp. Form.:
C19H22N4O3S2
Mol. Mass.:
418.533
SMILES:
COCCSc1nc(C)c(s1)-c1ccnc(Nc2ccc(OC)cc2OC)n1
: