Target
Phosphatidylinositol 4,5-bisphosphate 3-kinase catalytic subunit delta isoform
Ligand
BDBM118299
Substrate
Meas. Tech.
ChEMBL_1719230 (CHEMBL4134230)
IC50
101±n/a nM
Citation
 Hoegenauer, KSoldermann, NZécri, FStrang, RSGraveleau, NWolf, RMCooke, NGSmith, ABHollingworth, GJBlanz, JGutmann, SRummel, GLittlewood-Evans, ABurkhart, C Discovery of CDZ173 (Leniolisib), Representing a Structurally Novel Class of PI3K Delta-Selective Inhibitors. ACS Med Chem Lett 8:975-980 (2017)  
Target
Name:
Phosphatidylinositol 4,5-bisphosphate 3-kinase catalytic subunit delta isoform
Synonyms:
PI3-kinase subunit delta PI3K-delta PK3CD_MOUSE Pik3cd PtdIns-3-kinase subunit p110-delta | p110delta
Type:
Enzyme
Mol. Mass.:
119725.20
Organism:
Mus musculus (Mouse)
Description:
O35904
Residue:
1043
  
Inhibitor
Name:
BDBM118299
Synonyms:
US8653092, 67
Type:
Small organic molecule
Emp. Form.:
C21H25F3N6O2
Mol. Mass.:
450.4574
SMILES:
CCC(=O)N1CC[C@@H](C1)Nc1ncnc2CCN(Cc12)c1cnc(OC)c(c1)C(F)(F)F
: