Target
5-hydroxytryptamine receptor 2B
Ligand
BDBM118299
Substrate
Meas. Tech.
ChEBML_1719237
IC50
7700±n/a nM
Citation
 Hoegenauer, KSoldermann, NZécri, FStrang, RSGraveleau, NWolf, RMCooke, NGSmith, ABHollingworth, GJBlanz, JGutmann, SRummel, GLittlewood-Evans, ABurkhart, C Discovery of CDZ173 (Leniolisib), Representing a Structurally Novel Class of PI3K Delta-Selective Inhibitors. ACS Med Chem Lett 8:975-980 (2017)  
Target
Name:
5-hydroxytryptamine receptor 2B
Synonyms:
5-HT-2B 5-hydroxytryptamine (serotonin) receptor 2B [Homo sapiens] 5-hydroxytryptamine receptor 2C (5HT2C) HTR2B Serotonin 2b (5-HT2b) receptor | Serotonin Receptor 2B
Type:
G Protein-Coupled Receptor (GPCR)
Mol. Mass.:
54312.47
Organism:
Homo sapiens (Human)
Description:
Receptor binding assays were performed using human clone stably expressed in CHO cells.
Residue:
481
  
Inhibitor
Name:
BDBM118299
Synonyms:
US8653092, 67
Type:
Small organic molecule
Emp. Form.:
C21H25F3N6O2
Mol. Mass.:
450.4574
SMILES:
CCC(=O)N1CC[C@@H](C1)Nc1ncnc2CCN(Cc12)c1cnc(OC)c(c1)C(F)(F)F
: