Target
Proto-oncogene tyrosine-protein kinase Src
Ligand
BDBM50279733
Substrate
Meas. Tech.
ChEMBL_1721609 (CHEMBL4136609)
Ki
22±n/a nM
Citation
 Wang, TBemis, GHanzelka, BZuccola, HWynn, MMoody, CSGreen, JLocher, CLiu, AGao, HXu, YWang, SWang, JBennani, YLThomson, JAMüh, U Mtb PKNA/PKNB Dual Inhibition Provides Selectivity Advantages for Inhibitor Design To Minimize Host Kinase Interactions. ACS Med Chem Lett 8:1224-1229 (2017)  
Target
Name:
Proto-oncogene tyrosine-protein kinase Src
Synonyms:
Calmodulin/Proto-oncogene tyrosine-protein kinase Src Proto-oncogene c-Src SRC SRC_HUMAN V-src sarcoma (Schmidt-Ruppin A-2) viral oncogene homolog (avian) p60-Src | pp60c-src
Type:
Protein
Mol. Mass.:
59838.60
Organism:
Homo sapiens (Human)
Description:
P12931
Residue:
536
  
Inhibitor
Name:
BDBM50279733
Synonyms:
CHEMBL4174082
Type:
Small organic molecule
Emp. Form.:
C21H16N6
Mol. Mass.:
352.3919
SMILES:
N#Cc1cccc(c1)-c1nc(Nc2cc([nH]n2)C2CC2)c2ccccc2n1
: