Target
D(1A) dopamine receptor
Ligand
BDBM82247
Substrate
Meas. Tech.
ChEMBL_60198 (CHEMBL673360)
Ki
0.100±n/a nM
Citation
 Neumeyer, JLBaindur, NYuan, JBooth, GSeeman, PNiznik, HB Development of a high affinity and stereoselective photoaffinity label for the D-1 dopamine receptor: synthesis and resolution of 7-[125I]iodo-8-hydroxy-3-methyl-1-(4'-azidophenyl)-2,3,4,5-tetrahydro- 1H-3-benzazepine. J Med Chem 33:521-6 (1990)  
Target
Name:
D(1A) dopamine receptor
Synonyms:
D(1A) dopamine receptor DOPAMINE D1 DRD1_BOVIN | Dopamine receptor
Type:
Enzyme Catalytic Domain
Mol. Mass.:
49330.65
Organism:
BOVINE
Description:
DOPAMINE D1 DRD1 BOVINE::Q95136
Residue:
446
  
Inhibitor
Name:
BDBM82247
Synonyms:
8-Chloro-3-methyl-5-phenyl-2,3,4,5-tetrahydro-1H-benzo[d]azepin-7-ol(SCH 23390) CHEMBL2158641 SCH 23388 SCH 23390 (R-enantiomer) | SCH 23390,R(+)
Type:
Small organic molecule
Emp. Form.:
C17H18ClNO
Mol. Mass.:
287.784
SMILES:
CN1CCc2cc(Cl)c(O)cc2[C@H](C1)c1ccccc1
: