Target
D(2) dopamine receptor
Ligand
BDBM82247
Substrate
Meas. Tech.
ChEBML_61571
IC50
>10000±n/a nM
Citation
 Schaus, JMTitus, RDForeman, MMMason, NRTruex, LL Aporphines as antagonists of dopamine D-1 receptors. J Med Chem 33:600-7 (1990)  
Target
Name:
D(2) dopamine receptor
Synonyms:
DOPAMINE D2 DOPAMINE D2 Short Dopamine D2 receptor Drd2
Type:
G Protein-Coupled Receptor (GPCR)
Mol. Mass.:
50931.60
Organism:
Rattus norvegicus (rat)
Description:
P61169
Residue:
444
  
Inhibitor
Name:
BDBM82247
Synonyms:
8-Chloro-3-methyl-5-phenyl-2,3,4,5-tetrahydro-1H-benzo[d]azepin-7-ol(SCH 23390) CHEMBL2158641 SCH 23388 SCH 23390 (R-enantiomer) | SCH 23390,R(+)
Type:
Small organic molecule
Emp. Form.:
C17H18ClNO
Mol. Mass.:
287.784
SMILES:
CN1CCc2cc(Cl)c(O)cc2[C@H](C1)c1ccccc1
: