Target
Renin
Ligand
BDBM50016039
Substrate
Meas. Tech.
ChEBML_192730
IC50
4400±n/a nM
Citation
 Kaltenbronn, JSHudspeth, JPLunney, EAMichniewicz, BMNicolaides, EDRepine, JTRoarK, WHStier, MATinney, FJWoo, PK Renin inhibitors containing isosteric replacements of the amide bond connecting the P3 and P2 sites. J Med Chem 33:838-45 (1990)  
Target
Name:
Renin
Synonyms:
Angiotensinogenase RENI_HUMAN
Type:
Enzyme
Mol. Mass.:
45058.99
Organism:
Homo sapiens (Human)
Description:
Residue:
406
  
Inhibitor
Name:
BDBM50016039
Synonyms:
CHEMBL169818 | [1-(3-{[1-Benzyl-3-(1-benzylcarbamoyl-3-methyl-butylcarbamoyl)-2-hydroxy-propylcarbamoyl]-methyl}-oxiranyl)-2-phenyl-ethyl]-carbamic acid tert-butyl ester : (0.7 CH2 Cl2)
Type:
Small organic molecule
Emp. Form.:
C41H54N4O7
Mol. Mass.:
714.8901
SMILES:
CC(C)C[C@H](NC(=O)C[C@@H](O)C(Cc1ccccc1)NC(=O)CC1OC1[C@H](Cc1ccccc1)NC(=O)OC(C)(C)C)C(=O)NCc1ccccc1
: