Target
Renin
Ligand
BDBM50016047
Substrate
Meas. Tech.
ChEBML_192730
IC50
640±n/a nM
Citation
 Kaltenbronn, JSHudspeth, JPLunney, EAMichniewicz, BMNicolaides, EDRepine, JTRoarK, WHStier, MATinney, FJWoo, PK Renin inhibitors containing isosteric replacements of the amide bond connecting the P3 and P2 sites. J Med Chem 33:838-45 (1990)  
Target
Name:
Renin
Synonyms:
Angiotensinogenase RENI_HUMAN
Type:
Enzyme
Mol. Mass.:
45058.99
Organism:
Homo sapiens (Human)
Description:
Residue:
406
  
Inhibitor
Name:
BDBM50016047
Synonyms:
(1-Benzyl-4-{1-[2-(1-benzylcarbamoyl-3-methyl-butylcarbamoyl)-1-hydroxy-ethyl]-3-methyl-butylcarbamoyl}-2-hydroxy-butyl)-carbamic acid tert-butyl ester | CHEMBL355409
Type:
Small organic molecule
Emp. Form.:
C38H58N4O7
Mol. Mass.:
682.8897
SMILES:
CC(C)C[C@H](NC(=O)CCC(O)[C@H](Cc1ccccc1)NC(=O)OC(C)(C)C)C(O)CC(=O)N[C@@H](CC(C)C)C(=O)NCc1ccccc1
: