Target
Vasopressin V1a/V1b receptor
Ligand
BDBM50016310
Substrate
Meas. Tech.
ChEMBL_214382 (CHEMBL821113)
Kd
27±n/a nM
Citation
 Grzonka, ZKasprzykowski, FKojro, EDarlak, KMelin, PFahrenholz, FCrause, PBoer, R Arginine-vasopressin analogues with high antidiuretic/vasopressor selectivity. Synthesis, biological activity, and receptor binding affinity of arginine-vasopressin analogues with substitutions in positions 1, 2, 4, 7, and 8. J Med Chem 29:96-9 (1986)  
Target
Name:
Vasopressin V1a/V1b receptor
Synonyms:
Vasopressin V1 receptor
Type:
Mol. Mass.:
Description:
ASSAY_ID of ChEMBL is 214265
Components:
This complex has 2 components.
Component 1
Name:
Vasopressin V1a receptor
Synonyms:
Avpr1a VASOPRESSIN V1A Vasopressin V1a receptor | Vasopressin receptor
Type:
Enzyme Catalytic Domain
Mol. Mass.:
47674.81
Organism:
RAT
Description:
VASOPRESSIN V1A AVPR1A RAT::P30560
Residue:
424
  
Component 2
Name:
Vasopressin V1b receptor
Synonyms:
Avpr1b VASOPRESSIN V1B Vasopressin receptor
Type:
Enzyme Catalytic Domain
Mol. Mass.:
47104.48
Organism:
RAT
Description:
VASOPRESSIN V1B AVPR1B RAT::P48974
Residue:
425
  
Inhibitor
Name:
BDBM50016310
Synonyms:
CHEMBL406303 | [Mpa1Val4Sar7]AVP (Arginine-vasopressin )
Type:
Small organic molecule
Emp. Form.:
C44H63N13O11S2
Mol. Mass.:
1014.182
SMILES:
CC(C)[C@H]1NC(=O)[C@H](Cc2ccccc2)NC(=O)[C@@H](Cc2ccc(O)cc2)NC(=O)CCSSC[C@H](NC(=O)[C@H](CC(N)=O)NC1=O)C(=O)N(C)CC(=O)N[C@@H](CCCNC(N)=N)C(=O)NCC(N)=O
: