Target
Dihydrofolate reductase
Ligand
BDBM50016343
Substrate
Meas. Tech.
ChEBML_54440
IC50
310±n/a nM
Citation
 Rosowsky, AForsch, RAFreisheim, JHDanenberg, PVMoran, RGWick, MM Methotrexate analogues. 29. Effect of gamma-aminobutyric acid spacers between the pteroyl and glutamate moieties on enzyme binding and cell growth inhibition. J Med Chem 29:1872-6 (1986)  
Target
Name:
Dihydrofolate reductase
Synonyms:
DYR_MOUSE | Dhfr
Type:
Enzyme
Mol. Mass.:
21608.82
Organism:
Mus musculus (Mouse)
Description:
Residue:
187
  
Inhibitor
Name:
BDBM50016343
Synonyms:
2-{4-[4-(4-{4-[(2,4-Diamino-pteridin-6-ylmethyl)-methyl-amino]-benzoylamino}-butyrylamino)-butyrylamino]-butyrylamino}-pentanedioic acid | CHEMBL54833
Type:
Small organic molecule
Emp. Form.:
C32H43N11O8
Mol. Mass.:
709.7527
SMILES:
CN(Cc1cnc2nc(N)nc(N)c2n1)c1ccc(cc1)C(=O)NCCCC(=O)NCCCC(=O)NCCCC(=O)NC(CCC(O)=O)C(O)=O
: