Target
Cathepsin D
Ligand
BDBM912
Substrate
Meas. Tech.
ChEMBL_1725727 (CHEMBL4141005)
IC50
100±n/a nM
Citation
 Al-Awadhi, FHLaw, BKPaul, VJLuesch, H Grassystatins D-F, Potent Aspartic Protease Inhibitors from Marine Cyanobacteria as Potential Antimetastatic Agents Targeting Invasive Breast Cancer. J Nat Prod 80:2969-2986 (2017)  
Target
Name:
Cathepsin D
Synonyms:
CATD_HUMAN CTSD Cathepsin D heavy chain Cathepsin D precursor
Type:
Enzyme
Mol. Mass.:
44551.72
Organism:
Homo sapiens (Human)
Description:
Human proCathepsin D (SwissProt accession number P07339) was expressed in Sf9 cells, purified, and autoactivated.
Residue:
412
  
Inhibitor
Name:
BDBM912
Synonyms:
(3S,4S)-3-hydroxy-4-[(2S)-2-[(3S,4S)-3-hydroxy-6-methyl-4-[(2S)-3-methyl-2-[(2S)-3-methyl-2-(3-methylbutanamido)butanamido]butanamido]heptanamido]propanamido]-6-methylheptanoic acid Iva-Val-Val-Sta-Ala-Sta-OH PEPSTATIN US9115083, Pepstatin
Type:
Small organic molecule
Emp. Form.:
C34H63N5O9
Mol. Mass.:
685.8921
SMILES:
CC(C)C[C@H](NC(=O)[C@H](C)NC(=O)C[C@H](O)[C@H](CC(C)C)NC(=O)[C@@H](NC(=O)[C@@H](NC(=O)CC(C)C)C(C)C)C(C)C)[C@@H](O)CC(O)=O
: