Target
Egl nine homolog 1
Ligand
BDBM50286247
Substrate
Meas. Tech.
ChEMBL_1728899 (CHEMBL4144177)
IC50
1200±n/a nM
Citation
 Ogoshi, YMatsui, TMitani, IYokota, MTerashita, MMotoda, DUeyama, KHotta, TIto, THase, YFukui, KDeai, KYoshiuchi, HIto, SAbe, H Discovery of JTZ-951: A HIF Prolyl Hydroxylase Inhibitor for the Treatment of Renal Anemia. ACS Med Chem Lett 8:1320-1325 (2017)  
Target
Name:
Egl nine homolog 1
Synonyms:
C1orf12 EGLN1_HUMAN Hypoxia-inducible factor prolyl hydroxylase 2 (HIF-PH2) Prolyl hydroxylase domain-containing protein 2 (PHD2)
Type:
Protein
Mol. Mass.:
46035.59
Organism:
Homo sapiens (Human)
Description:
Q9GZT9
Residue:
426
  
Inhibitor
Name:
BDBM50286247
Synonyms:
CHEMBL4164159
Type:
Small organic molecule
Emp. Form.:
C9H9ClN4O4
Mol. Mass.:
272.645
SMILES:
Cl.OC(=O)CNC(=O)c1c(O)ccn2cnnc12
: