Target
Histone deacetylase 1
Ligand
BDBM50286480
Substrate
Meas. Tech.
ChEMBL_1729075 (CHEMBL4144353)
IC50
91±n/a nM
Citation
 Chen, WDong, GWu, YZhang, WMiao, CSheng, C Dual NAMPT/HDAC Inhibitors as a New Strategy for Multitargeting Antitumor Drug Discovery. ACS Med Chem Lett 9:34-38 (2018)  
Target
Name:
Histone deacetylase 1
Synonyms:
Cereblon/Histone deacetylase 1 HDAC1 Histone deacetylase 1 (HDAC1) RPD3L1
Type:
Enzyme
Mol. Mass.:
55090.27
Organism:
Homo sapiens (Human)
Description:
Q13547
Residue:
482
  
Inhibitor
Name:
BDBM50286480
Synonyms:
CHEMBL4159972
Type:
Small organic molecule
Emp. Form.:
C27H27FN6O3S
Mol. Mass.:
534.605
SMILES:
ONC(=O)\C=C\c1ccc(CN(Cc2ccc(F)cc2)c2ncc(s2)C(=O)NCCCn2ccnc2)cc1
: