Target
Polyunsaturated fatty acid 5-lipoxygenase
Ligand
BDBM50016686
Substrate
Meas. Tech.
ChEBML_4270
IC50
100±n/a nM
Citation
 Huang, FCShoupe, TSLin, CJLee, TDChan, WKTan, JSchnapper, MSuh, JTGordon, RJSonnino, PA Differential effects of a series of hydroxamic acid derivatives on 5-lipoxygenase and cyclooxygenase from neutrophils and 12-lipoxygenase from platelets and their in vivo effects on inflammation and anaphylaxis. J Med Chem 32:1836-42 (1989)  
Target
Name:
Polyunsaturated fatty acid 5-lipoxygenase
Synonyms:
Alox5 LOX5_RAT
Type:
PROTEIN
Mol. Mass.:
78082.31
Organism:
Rattus norvegicus
Description:
ChEMBL_1432947
Residue:
673
  
Inhibitor
Name:
BDBM50016686
Synonyms:
CHEMBL54013 | N-Hydroxy-3-phenyl-N-(3-phenyl-propyl)-propionamide
Type:
Small organic molecule
Emp. Form.:
C18H21NO2
Mol. Mass.:
283.3648
SMILES:
ON(CCCc1ccccc1)C(=O)CCc1ccccc1
: