Target
Polyunsaturated fatty acid 5-lipoxygenase
Ligand
BDBM50006819
Substrate
Meas. Tech.
ChEMBL_3860 (CHEMBL618764)
Ki
100±n/a nM
Citation
 Huang, FCShoupe, TSLin, CJLee, TDChan, WKTan, JSchnapper, MSuh, JTGordon, RJSonnino, PA Differential effects of a series of hydroxamic acid derivatives on 5-lipoxygenase and cyclooxygenase from neutrophils and 12-lipoxygenase from platelets and their in vivo effects on inflammation and anaphylaxis. J Med Chem 32:1836-42 (1989)  
Target
Name:
Polyunsaturated fatty acid 5-lipoxygenase
Synonyms:
5-LO 5-Lipoxygenase (5-LO) 5-Lipoygenase ALOX5 LOG5 | LOX5_HUMAN
Type:
Enzyme
Mol. Mass.:
77972.74
Organism:
Homo sapiens (Human)
Description:
Recombinant protein was purified from E. coli lysate. After ammonium sulfate precipitation and subsequent steps, the supernatant (S100) was used for 5-LO activity assay.
Residue:
674
  
Inhibitor
Name:
BDBM50006819
Synonyms:
2-(4-Benzyloxy-phenyl)-N-hydroxy-N-phenethyl-acetamide RG-6820
Type:
Small organic molecule
Emp. Form.:
C23H23NO3
Mol. Mass.:
361.4336
SMILES:
ON(CCc1ccccc1)C(=O)Cc1ccc(OCc2ccccc2)cc1
: