Target
5-hydroxytryptamine receptor 1A
Ligand
BDBM50016736
Substrate
Meas. Tech.
ChEBML_1152
Ki
2.3±n/a nM
Citation
 Naiman, NLyon, RABullock, AERydelek, LTTiteler, MGlennon, RA 2-(Alkylamino)tetralin derivatives: interaction with 5-HT1A serotonin binding sites. J Med Chem 32:253-6 (1989)  
Target
Name:
5-hydroxytryptamine receptor 1A
Synonyms:
5-HT-1A 5-HT1A 5-hydroxytryptamine receptor 1A (5HT1A) 5ht1a Htr1a Serotonin 1a (5-HT1a) receptor/Adrenergic receptor alpha-1 | Serotonin receptor 1A
Type:
G Protein-Coupled Receptor (GPCR)
Mol. Mass.:
46445.29
Organism:
Rattus norvegicus (rat)
Description:
Binding assays were performed using rat hippocampal membranes.
Residue:
422
  
Inhibitor
Name:
BDBM50016736
Synonyms:
(8-Methoxy-1,2,3,4-tetrahydro-naphthalen-2-yl)-propyl-amine | CHEMBL27019
Type:
Small organic molecule
Emp. Form.:
C14H21NO
Mol. Mass.:
219.3226
SMILES:
CCCNC1CCc2cccc(OC)c2C1
: