Target
Polyunsaturated fatty acid 5-lipoxygenase
Ligand
BDBM50016987
Substrate
Meas. Tech.
ChEBML_157778
IC50
20±n/a nM
Citation
 Lau, CKBélanger, PCScheigetz, JDufresne, CWilliams, HWMaycock, ALGuindon, YBach, TDallob, ALDenis, D Synthesis and structure-activity relationships of a novel class of 5-lipoxygenase inhibitors. 2-(Phenylmethyl)-4-hydroxy-3,5-dialkylbenzofurans: the development of L-656,224. J Med Chem 32:1190-7 (1989)  
Target
Name:
Polyunsaturated fatty acid 5-lipoxygenase
Synonyms:
5-LO 5-Lipoxygenase (5-LO) 5-Lipoygenase ALOX5 LOG5 | LOX5_HUMAN
Type:
Enzyme
Mol. Mass.:
77972.74
Organism:
Homo sapiens (Human)
Description:
Recombinant protein was purified from E. coli lysate. After ammonium sulfate precipitation and subsequent steps, the supernatant (S100) was used for 5-LO activity assay.
Residue:
674
  
Inhibitor
Name:
BDBM50016987
Synonyms:
7-Chloro-2-(4-methoxy-benzyl)-3,5-dipropyl-benzofuran-4-ol | CHEMBL18989
Type:
Small organic molecule
Emp. Form.:
C22H25ClO3
Mol. Mass.:
372.885
SMILES:
CCCc1c(Cc2ccc(OC)cc2)oc2c(Cl)cc(CCC)c(O)c12
: