Target
Bifunctional glucose-6-phosphate 1-dehydrogenase/6-phosphogluconolactonase
Ligand
BDBM50292586
Substrate
Meas. Tech.
ChEMBL_1731847 (CHEMBL4147383)
Ki
68800±n/a nM
Citation
 Alencar, NSola, ILinares, MJuárez-Jiménez, JPont, CViayna, AVílchez, DSampedro, CAbad, PPérez-Benavente, SLameira, JBautista, JMMuñoz-Torrero, DLuque, FJ First homology model of Plasmodium falciparum glucose-6-phosphate dehydrogenase: Discovery of selective substrate analog-based inhibitors as novel antimalarial agents. Eur J Med Chem 146:108-122 (2018)  
Target
Name:
Bifunctional glucose-6-phosphate 1-dehydrogenase/6-phosphogluconolactonase
Synonyms:
6-phosphogluconolactonase G6PD GluPho PfGluPho
Type:
PROTEIN
Mol. Mass.:
106988.99
Organism:
Plasmodium falciparum (isolate 3D7)
Description:
ChEMBL_117865
Residue:
910
  
Inhibitor
Name:
BDBM50292586
Synonyms:
CHEMBL4169301
Type:
Small organic molecule
Emp. Form.:
C10H17NO7S
Mol. Mass.:
295.309
SMILES:
CO[C@H]1O[C@H](CS(=O)(=O)CCC#N)[C@@H](O)[C@H](O)[C@H]1O
: