Target
Beta-2 adrenergic receptor
Ligand
BDBM50017380
Substrate
Meas. Tech.
ChEBML_37979
IC50
7900±n/a nM
Citation
 Jamart-Gregoire, BCaubere, PBlanc, MGnassounou, JPAdvenier, C A new series of tricyclic (aryloximino)propanolamines displaying very high selective beta 2-blocking properties. J Med Chem 32:315-20 (1989)  
Target
Name:
Beta-2 adrenergic receptor
Synonyms:
ADRB2_CAVPO adrenergic Beta2
Type:
Enzyme Catalytic Domain
Mol. Mass.:
46993.24
Organism:
GUINEA PIG
Description:
adrenergic Beta2 ADRB2 GUINEA PIG::Q8K4Z4
Residue:
418
  
Inhibitor
Name:
BDBM50017380
Synonyms:
9a-(2-Hydroxy-ethoxy)-5,6,7,8,9,9a-hexahydro-4bH-benzo[a]azulen-10-one O-(3-tert-butylamino-2-hydroxy-propyl)-oxime | CHEMBL324412
Type:
Small organic molecule
Emp. Form.:
C23H36N2O4
Mol. Mass.:
404.5429
SMILES:
CC(C)(C)NCC(O)CO\N=C1\c2ccccc2C2CCCCCC12OCCO
: